{"text_format":"1","workbook":"xlsx","n_sheets":2,"sheets":["ｱｸﾛｼﾃｨV3からの差し込みデータ","申込書"],"not_rendered":{"charts":0,"images":1,"macros":0,"external_links":0,"defined_names":5,"comments":0,"pivot_tables":0},"unopened":[],"bounds":{"document_bytes":16777216,"sheet_cells":100000,"rows_first":2000,"rows_last":500,"rows_between":2000,"halvings":0,"cell_chars":16384,"cell_head_chars":4096},"cells_cut":0,"cells_raw":0,"read":"whole","date_system":"1900"}

{"sheet":"ｱｸﾛｼﾃｨV3からの差し込みデータ","index":0,"n_rows":34,"n_cols":13,"rows_kept":34,"cut":false,"hidden":true,"merged":[]}
[null,null,null,null,null,null,null,"年齢基準日",{"$f":"#REF!","v":{"$error":"#REF!"}},"←基準日は手入力"]
[null,"申請者住民コード","申請者氏名","申請者カナ","申請者生年月日","申請者性別","申請者続柄【印字用】","申請者年齢（現時点）","申請者年齢（4/1時点）"]
[null,null,null,null,null,null,null,null,{"$f":"DATEDIF(M3,$I$1,\"Y\")","v":{"$error":"#VALUE!"}},null,null,null,{"$f":"SUBSTITUTE(E3,\" \",\"\")","v":""}]
[]
["■世帯の情報①",null,null,null,null,null,null,null,null,"ピンク部分は差込ではなく、関数式。"]
[null,"郵便番号","申請者住所方書",null,"申請者電話番号【印字用】"]
[]
[]
["■世帯の情報②"]
[null,"母子父子世帯","児童扶養手当受給世帯（全世帯）",null,"特別児童扶養手当受給世帯（全世帯）","障害者世帯",null,"生活保護者がいる世帯"]
[]
[]
["■世帯員の構成"]
["対象者","住民コード","氏名","カナ","生年月日","性別","続柄","年齢（4/1時点）",{"$f":"L14","v":"住民税課税情報の有無"},"市区町村民税額_市区町村民税均等割額","市区町村民税額_市区町村民税所得割額","住民税課税情報の有無","生年月日（スペース削除）"]
[1,null,null,null,null,null,null,{"$f":"DATEDIF(M15,$I$1,\"Y\")","v":{"$error":"#VALUE!"}},{"$f":"IF(L15=1,\"税情報あり\",\"税情報なし\")","v":"税情報なし"},null,null,null,{"$f":"SUBSTITUTE(E15,\" \",\"\")","v":""}]
[2,null,null,null,null,null,null,{"$f":"DATEDIF(M16,$I$1,\"Y\")","v":{"$error":"#VALUE!"}},{"$f":"IF(L16=1,\"税情報あり\",\"税情報なし\")","v":"税情報なし"},null,null,null,{"$f":"SUBSTITUTE(E16,\" \",\"\")","v":""}]
[3,null,null,null,null,null,null,{"$error":"#VALUE!"},"税情報なし",null,null,null,""]
[4,null,null,null,null,null,null,{"$error":"#VALUE!"},"税情報なし",null,null,null,""]
[5,null,null,null,null,null,null,{"$error":"#VALUE!"},"税情報なし",null,null,null,""]
[6,null,null,null,null,null,null,{"$error":"#VALUE!"},"税情報なし",null,null,null,""]
[7,null,null,null,null,null,null,{"$error":"#VALUE!"},"税情報なし",null,null,null,""]
[8,null,null,null,null,null,null,{"$error":"#VALUE!"},"税情報なし",null,null,null,""]
[9,null,null,null,null,null,null,{"$error":"#VALUE!"},"税情報なし",null,null,null,""]
[10,null,null,null,null,null,null,{"$error":"#VALUE!"},"税情報なし",null,null,null,""]
[11,null,null,null,null,null,null,{"$error":"#VALUE!"},"税情報なし",null,null,null,""]
[12,null,null,null,null,null,null,{"$error":"#VALUE!"},"税情報なし",null,null,null,""]
[13,null,null,null,null,null,null,{"$error":"#VALUE!"},"税情報なし",null,null,null,""]
[14,null,null,null,null,null,null,{"$error":"#VALUE!"},"税情報なし",null,null,null,""]
[15,null,null,null,null,null,null,{"$error":"#VALUE!"},"税情報なし",null,null,null,""]
[16,null,null,null,null,null,null,{"$error":"#VALUE!"},"税情報なし",null,null,null,""]
[17,null,null,null,null,null,null,{"$error":"#VALUE!"},"税情報なし",null,null,null,""]
[18,null,null,null,null,null,null,{"$error":"#VALUE!"},"税情報なし",null,null,null,""]
[19,null,null,null,null,null,null,{"$error":"#VALUE!"},"税情報なし",null,null,null,""]
[20,null,null,null,null,null,null,{"$error":"#VALUE!"},"税情報なし",null,null,null,""]

{"sheet":"申込書","index":1,"n_rows":255,"n_cols":90,"rows_kept":255,"cut":false,"hidden":false,"merged":[[205,4,252,90],[204,4,204,90],[254,4,260,90],[195,89,198,94],[199,1,202,3],[199,4,202,41],[199,42,202,68],[199,69,202,74],[199,75,202,88],[199,89,202,94],[195,1,198,3],[195,4,198,41],[195,42,198,68],[195,69,198,74],[195,75,198,88],[191,89,192,94],[193,1,194,3],[193,4,194,41],[193,42,194,68],[193,69,194,74],[193,75,194,88],[193,89,194,94],[191,1,192,3],[191,4,192,41],[191,42,192,68],[191,69,192,74],[191,75,192,88],[187,89,188,94],[189,1,190,3],[189,4,190,41],[189,42,190,68],[189,69,190,74],[189,75,190,88],[189,89,190,94],[187,1,188,3],[187,4,188,41],[187,42,188,68],[187,69,188,74],[187,75,188,88],[183,89,184,94],[185,1,186,3],[185,4,186,41],[185,42,186,68],[185,69,186,74],[185,75,186,88],[185,89,186,94],[183,1,184,3],[183,4,184,41],[183,42,184,68],[183,69,184,74],[183,75,184,88],[175,42,175,94],[177,1,180,94],[181,1,182,3],[181,4,182,41],[181,42,182,68],[181,69,181,88],[181,89,182,94],[182,69,182,74],[182,75,182,88],[171,1,172,3],[171,4,172,41],[171,42,172,94],[173,1,174,3],[173,4,174,41],[173,42,174,94],[165,1,166,3],[165,4,166,41],[165,42,166,94],[167,1,170,3],[167,4,170,41],[167,42,170,94],[161,1,162,3],[161,4,162,41],[161,42,162,94],[163,1,164,3],[163,4,164,41],[163,42,164,94],[153,1,156,89],[157,1,158,94],[159,1,160,3],[159,4,160,41],[159,42,160,94],[148,50,152,52],[148,53,152,69],[148,70,152,85],[149,4,149,27],[150,4,150,27],[151,4,152,5],[151,6,152,7],[151,8,152,9],[151,10,152,11],[151,12,152,13],[151,14,152,15],[151,16,152,17],[151,18,152,19],[151,20,152,21],[151,22,152,23],[151,24,152,25],[148,4,148,11],[148,12,148,27],[148,28,152,35],[148,36,152,46],[148,47,152,49],[151,26,152,27],[143,50,147,52],[143,53,147,69],[143,70,147,85],[144,4,144,27],[145,4,145,27],[146,4,147,5],[146,6,147,7],[146,8,147,9],[146,10,147,11],[146,12,147,13],[146,14,147,15],[146,16,147,17],[146,18,147,19],[146,20,147,21],[146,22,147,23],[146,24,147,25],[143,4,143,11],[143,12,143,27],[143,28,147,35],[143,36,147,46],[143,47,147,49],[146,26,147,27],[138,50,142,52],[138,53,142,69],[138,70,142,85],[139,4,139,27],[140,4,140,27],[141,4,142,5],[141,6,142,7],[141,8,142,9],[141,10,142,11],[141,12,142,13],[141,14,142,15],[141,16,142,17],[141,18,142,19],[141,20,142,21],[141,22,142,23],[141,24,142,25],[138,4,138,11],[138,12,138,27],[138,28,142,35],[138,36,142,46],[138,47,142,49],[141,26,142,27],[133,50,137,52],[133,53,137,69],[133,70,137,85],[134,4,134,27],[135,4,135,27],[136,4,137,5],[136,6,137,7],[136,8,137,9],[136,10,137,11],[136,12,137,13],[136,14,137,15],[136,16,137,17],[136,18,137,19],[136,20,137,21],[136,22,137,23],[136,24,137,25],[133,4,133,11],[133,12,133,27],[133,28,137,35],[133,36,137,46],[133,47,137,49],[136,26,137,27],[128,50,132,52],[128,53,132,69],[128,70,132,85],[128,86,152,94],[129,4,129,27],[130,4,130,27],[131,4,132,5],[131,6,132,7],[131,8,132,9],[131,10,132,11],[131,12,132,13],[131,14,132,15],[131,16,132,17],[131,18,132,19],[131,20,132,21],[131,22,132,23],[128,4,128,11],[128,12,128,27],[128,28,132,35],[128,36,132,46],[128,47,132,49],[131,24,132,25],[131,26,132,27],[123,50,127,52],[123,53,127,69],[123,70,127,85],[123,86,123,94],[124,4,124,27],[124,86,127,94],[125,4,125,27],[126,4,127,5],[126,6,127,7],[126,8,127,9],[126,10,127,11],[126,12,127,13],[126,14,127,15],[126,16,127,17],[126,18,127,19],[126,20,127,21],[123,4,123,11],[123,12,123,27],[123,28,127,35],[123,36,127,46],[123,47,127,49],[126,22,127,23],[126,24,127,25],[126,26,127,27],[119,4,119,27],[120,4,120,27],[121,4,122,5],[121,6,122,7],[121,8,122,9],[121,10,122,11],[121,12,122,13],[121,14,122,15],[121,16,122,17],[121,18,122,19],[121,20,122,21],[121,22,122,23],[121,24,122,25],[121,26,122,27],[118,28,122,35],[118,36,122,46],[118,47,122,49],[118,50,122,52],[118,53,122,69],[116,22,117,23],[116,24,117,25],[116,26,117,27],[118,4,118,11],[118,12,118,27],[113,47,117,49],[113,50,117,52],[113,53,117,69],[113,70,117,85],[113,86,122,94],[118,70,122,85],[113,1,152,3],[113,4,113,11],[113,12,113,27],[113,28,117,35],[113,36,117,46],[114,4,114,27],[115,4,115,27],[116,4,117,5],[116,6,117,7],[116,8,117,9],[116,10,117,11],[116,12,117,13],[116,14,117,15],[116,16,117,17],[116,18,117,19],[116,20,117,21],[109,1,110,94],[111,1,112,3],[111,4,111,27],[111,28,112,35],[111,36,112,46],[111,47,112,49],[111,50,112,52],[111,53,112,69],[111,70,112,85],[111,86,112,94],[112,4,112,27],[106,1,106,94],[100,8,101,94],[102,8,103,94],[104,8,105,94],[96,1,97,94],[102,1,103,7],[104,1,105,7],[98,1,99,12],[98,13,99,35],[100,1,101,7],[87,1,90,17],[66,30,69,73],[70,30,73,73],[74,30,77,73],[29,70,39,72],[29,73,31,94],[32,73,35,83],[36,73,39,83],[66,23,69,29],[70,23,73,29],[74,23,77,29],[78,23,81,29],[82,23,85,29],[87,18,90,94],[82,18,85,22],[43,1,45,16],[91,45,94,53],[91,54,92,94],[93,1,94,17],[93,18,94,44],[93,54,94,94],[91,1,92,17],[91,18,92,44],[21,84,28,94],[15,1,17,93],[6,68,7,92],[13,35,13,36],[13,62,13,93],[1,1,2,29],[7,9,10,11],[6,9,6,40],[1,65,5,94],[3,1,4,64],[5,1,5,45],[49,1,60,73],[61,1,62,73],[47,1,48,73],[47,75,48,94],[63,18,65,22],[66,18,69,22],[70,18,73,22],[74,18,77,22],[78,18,81,22],[63,23,65,29],[63,30,65,73],[63,1,85,17],[49,75,85,94],[78,30,81,73],[82,30,85,73],[43,17,44,94],[45,17,45,94],[29,1,39,16],[7,22,10,28],[7,12,10,21],[18,84,20,94],[21,73,22,83],[23,17,28,50],[23,73,28,83],[7,29,10,40],[13,1,13,34],[18,1,28,16],[18,17,20,50],[18,51,20,72],[18,73,20,83],[40,1,41,16],[7,43,10,59],[32,17,39,69],[29,17,31,69],[32,84,35,94],[36,84,39,94],[22,51,24,55],[23,56,25,57],[23,58,25,60],[23,61,25,63],[23,64,25,66],[23,67,25,69],[23,70,25,72],[25,51,27,55],[40,17,41,52],[40,53,41,94],[21,17,22,22],[21,23,22,50]]}
[]
[null,"様式第１号（第６条、第１１条関係）"]
[]
[null,"令和５年度　利用申込書 兼 支給認定申請書〈施設型給付費・地域型保育給付費等〉"]
[]
[]
[null,null,null,null,null,null,null,null,null,"担　当　者　記　入　欄",null,null,null,null,null,null,null,null,null,null,null,null,null,null,null,null,null,null,null,null,null,null,null,null,null,null,null,null,null,null,null,null,null,null,null,null,null,null,null,null,null,null,null,null,null,null,null,null,null,null,null,null,null,null,null,null,null,null,"令和  　　年　  　月　  　日"]
[null,null,null,null,null,null,null,null,null,"区分",null,null,"　☐新規　\n　☐転園",null,null,null,null,null,null,null,null,null,"認可申込\nきょうだい",null,null,null,null,null,null,"　□無　　　□新規\n　□在園　　□転園",null,null,null,null,null,null,null,null,null,null,null,null,null,{"$f":"IFERROR(\"住民CD_\"&VLOOKUP(#REF!,ｱｸﾛｼﾃｨV3からの差し込みデータ!$A$15:$M$34,2,FALSE),\"\")","v":""}]
[]
[]
[]
[]
[]
[null,"う　る　ま　市　長　　様",null,null,null,null,null,null,null,null,null,null,null,null,null,null,null,null,null,null,null,null,null,null,null,null,null,null,null,null,null,null,null,null,null,null,null,null,null,null,null,null,null,null,null,null,null,null,null,null,null,null,null,null,null,null,null,null,null,null,null,null,"申請保護者氏名 　　　 　　　　　　　　　　　　"]
[null,null,null,null,null,null,null,null,null,null,null,null,null,null,null,null,null,null,null,null,null,null,null,null,null,null,null,null,null,null,null,null,null,null,null,null,null,null,null,null,null,null,null,null,null,null,null,null,null,null,null,null,null,null,null,null,null,null,null,null,null,null,"※３ページ目の同意事項に同意の上、申請します。"]
[null,"次のとおり、施設型給付費・地域型保育給付費等にかかる「利用申込」と「支給認定申請」を併せて行います。"]
[]
[]
[null,"\n申請にかかる\n小学校就学前\n子   ど   も",null,null,null,null,null,null,null,null,null,null,null,null,null,null,null,"氏　　名",null,null,null,null,null,null,null,null,null,null,null,null,null,null,null,null,null,null,null,null,null,null,null,null,null,null,null,null,null,null,null,null,null,"生 年 月 日",null,null,null,null,null,null,null,null,null,null,null,null,null,null,null,null,null,null,null,null,null,"年　齢",null,null,null,null,null,null,null,null,null,null,"性　別"]
[]
[]
[null,null,null,null,null,null,null,null,null,null,null,null,null,null,null,null,null,"（ふりなが）",null,null,null,null,null,null,null,null,null,null,null,null,null,null,null,null,null,null,null,null,null,null,null,null,null,null,null,null,null,null,null,null,null,null,null,null,null,null,null,null,null,null,null,null,null,null,null,null,null,null,null,null,null,null,null,"※Ｒ5/4/1時点"]
[null,null,null,null,null,null,null,null,null,null,null,null,null,null,null,null,null,null,null,null,null,null,null,null,null,null,null,null,null,null,null,null,null,null,null,null,null,null,null,null,null,null,null,null,null,null,null,null,null,null,null,"令和"]
[null,null,null,null,null,null,null,null,null,null,null,null,null,null,null,null,null,null,null,null,null,null,null,null,null,null,null,null,null,null,null,null,null,null,null,null,null,null,null,null,null,null,null,null,null,null,null,null,null,null,null,null,null,null,null,null,null,null,"年",null,null,null,null,null,"月",null,null,null,null,null,"日",null,null,{"$f":"IFERROR(VLOOKUP(#REF!,ｱｸﾛｼﾃｨV3からの差し込みデータ!$A$15:$M$34,8,FALSE)+1,\"\")","v":""}]
[]
[null,null,null,null,null,null,null,null,null,null,null,null,null,null,null,null,null,null,null,null,null,null,null,null,null,null,null,null,null,null,null,null,null,null,null,null,null,null,null,null,null,null,null,null,null,null,null,null,null,null,null,"平成"]
[]
[]
[]
[null,"\n現　住　所",null,null,null,null,null,null,null,null,null,null,null,null,null,null,null,"〒　　　　 ―",null,null,null,null,null,null,null,null,null,null,null,null,null,null,null,null,null,null,null,null,null,null,null,null,null,null,null,null,null,null,null,null,null,null,null,null,null,null,null,null,null,null,null,null,null,null,null,null,null,null,null,null,"前住所",null,null,"(R4年1月1日付住所)\n※父・母で異なる場合はそれぞれ記載"]
[]
[]
[null,null,null,null,null,null,null,null,null,null,null,null,null,null,null,null,null,"うるま市",null,null,null,null,null,null,null,null,null,null,null,null,null,null,null,null,null,null,null,null,null,null,null,null,null,null,null,null,null,null,null,null,null,null,null,null,null,null,null,null,null,null,null,null,null,null,null,null,null,null,null,null,null,null,null,"父　　　　　　　　　　　都 道\n府 県",null,null,null,null,null,null,null,null,null,null,"母　　　　　　　　　　　都 道\n府 県"]
[]
[]
[]
[null,null,null,null,null,null,null,null,null,null,null,null,null,null,null,null,null,null,null,null,null,null,null,null,null,null,null,null,null,null,null,null,null,null,null,null,null,null,null,null,null,null,null,null,null,null,null,null,null,null,null,null,null,null,null,null,null,null,null,null,null,null,null,null,null,null,null,null,null,null,null,null,null,"市 区\n町 村",null,null,null,null,null,null,null,null,null,null,"市 区\n町 村"]
[]
[]
[]
[null,"連　絡　先",null,null,null,null,null,null,null,null,null,null,null,null,null,null,null,"(父携帯番号)　　   　　　- 　　　    　-",null,null,null,null,null,null,null,null,null,null,null,null,null,null,null,null,null,null,null,null,null,null,null,null,null,null,null,null,null,null,null,null,null,null,null,"(母携帯番号)　　　　 　　- 　　    　　-"]
[]
[]
[null,"利用開始を希望\nする期間 ",null,null,null,null,null,null,null,null,null,null,null,null,null,null,null,"令和　　年　　月　　日　　～　　令和　６年　３月３１日まで（※左記期間が選考対象期間となります。）"]
[]
[null,null,null,null,null,null,null,null,null,null,null,null,null,null,null,null,null,"※申請日よりさかのぼって支給認定証を発行することはできませんので、余裕をもって申請してください。"]
[]
[null,"①申込区分（☑チェックと園名を記入ください）",null,null,null,null,null,null,null,null,null,null,null,null,null,null,null,null,null,null,null,null,null,null,null,null,null,null,null,null,null,null,null,null,null,null,null,null,null,null,null,null,null,null,null,null,null,null,null,null,null,null,null,null,null,null,null,null,null,null,null,null,null,null,null,null,null,null,null,null,null,null,null,null,null,"③保育を必要とする事由"]
[]
[null,"　　【1号認定の申込み】※基本14時までの利用となります。　\n□　 (1)教育標準時間認定（1号認定）…認定こども園【　　　　　こども園】\n　　【2号認定、3号認定の申込み】\n□　（2）保育認定（２・３号認定）・・・保育所/認定こども園/小規模保育所/事業所内保育所",null,null,null,null,null,null,null,null,null,null,null,null,null,null,null,null,null,null,null,null,null,null,null,null,null,null,null,null,null,null,null,null,null,null,null,null,null,null,null,null,null,null,null,null,null,null,null,null,null,null,null,null,null,null,null,null,null,null,null,null,null,null,null,null,null,null,null,null,null,null,null,null,null,"下記の事由から該当する番号を記入して下さい。※入所希望月の状況（見込み）\n\n　続柄　　　番号　\n【　　父　　】　　　【　　　　　】\n【　　母　　】　　　【　　　　　】\n【　　　　　 】　　　【　　　　　】\n\n【事由番号】\n0：就労　　      　 6：災害復旧\n1：疾病・障害 　　7：妊娠・出産\n2：介護・看護\n3：求職活動\n4：就学\n5：育休、みなし育休"]
[]
[]
[]
[]
[]
[]
[]
[]
[]
[]
[]
[null,"②希望する場合施設名を記入（記載されていない園は入所選考に含まれません。）"]
[]
[null,"施設番号及び希望施設名どちらも記入してください。\n（令和５年度入園案内P18～29の施設番号を参照）\n\n※記入漏れがある場合、選考に影響が出る可能性があります。",null,null,null,null,null,null,null,null,null,null,null,null,null,null,null,null,"希望順",null,null,null,null,"施設番号",null,null,null,null,null,null,"希 望 施 設 名\n（※園の対象年齢と申請児童の年齢が異なる場合、選考対象となりません。）"]
[]
[]
[null,null,null,null,null,null,null,null,null,null,null,null,null,null,null,null,null,null,"第１希望",null,null,null,null,null,null,null,null,null,null,null,"保育所(園)"]
[]
[]
[]
[null,null,null,null,null,null,null,null,null,null,null,null,null,null,null,null,null,null,"第２希望",null,null,null,null,null,null,null,null,null,null,null,"保育所(園)"]
[]
[]
[]
[null,null,null,null,null,null,null,null,null,null,null,null,null,null,null,null,null,null,"第３希望",null,null,null,null,null,null,null,null,null,null,null,"保育所(園)"]
[]
[]
[]
[null,null,null,null,null,null,null,null,null,null,null,null,null,null,null,null,null,null,"第４希望",null,null,null,null,null,null,null,null,null,null,null,"保育所(園)"]
[]
[]
[]
[null,null,null,null,null,null,null,null,null,null,null,null,null,null,null,null,null,null,"第５希望",null,null,null,null,null,null,null,null,null,null,null,"保育所(園)"]
[]
[]
[]
[]
[null,"ア.今後の転居予定",null,null,null,null,null,null,null,null,null,null,null,null,null,null,null,null,"　□無・□有（転居予定日：Ｒ　　 年   　 月  　  日）　　（転居予定　　　　　　　　　　　　　　　　　　　　　校区）\n  ※こども園校区内加点（+5点）は、原則、入所選考時点の住所地に基づき加点します。（公立幼稚園から移行した認定こども園を希望する3～5歳児が対象）"]
[]
[]
[]
[null,"イ.出産予定の有無",null,null,null,null,null,null,null,null,null,null,null,null,null,null,null,null,"　□無・□有　（予定日:Ｒ　  年     月     日)",null,null,null,null,null,null,null,null,null,null,null,null,null,null,null,null,null,null,null,null,null,null,null,null,null,null,"エ.育休中の方",null,null,null,null,null,null,null,null,"　□入所決定後、入所月の翌月1日までに復帰が可能"]
[]
[null,"ウ.出産後の予定",null,null,null,null,null,null,null,null,null,null,null,null,null,null,null,null,"　□職場復帰 ・ □育休取得 ・ □その他 (         )",null,null,null,null,null,null,null,null,null,null,null,null,null,null,null,null,null,null,null,null,null,null,null,null,null,null,null,null,null,null,null,null,null,null,null,"　□育児休業を延長希望 （保育所等はR　　 年 　　月から希望）（延長希望－500点）"]
[]
[]
[null,"④きょうだいの入所選考の希望（「複数のきょうだいの利用申込」をする場合、必ず記入）　※認定こども園（1号）希望の場合は記入不要。"]
[]
[null,"番号記入欄",null,null,null,null,null,null,null,null,null,null,null,"●希望番号（　　　番）"]
[]
[null,1,null,null,null,null,null,null,"申込中のきょうだいと、同園の入園のみ、入園を希望します。　（※入園できない可能性が高くなります。）"]
[]
[null,2,null,null,null,null,null,null,"申込中のきょうだいと、同園の入園を希望しますが、同じ園に入れない場合に限り別々の園でも入園を希望します。"]
[]
[null,3,null,null,null,null,null,null,"申込中のきょうだいで、個々の希望順位を優先で入園を希望します。（きょうだい考慮なし）"]
[]
[null,"※きょうだい番号の記載がない場合や、きょうだいで別々の番号が選択されている場合は、「２」番として入所選考しますので、ご了承ください。"]
[]
[]
[null,"⑤家庭の状況(※入所希望月の1日時点の状況をご記入ください。)"]
[]
[null,"区分",null,null,"氏         名",null,null,null,null,null,null,null,null,null,null,null,null,null,null,null,null,null,null,null,null,null,null,null,"申込児童\nとの続柄",null,null,null,null,null,null,null,"生 年 月 日",null,null,null,null,null,null,null,null,null,null,"年\n齢",null,null,"多子軽減対象者",null,null," 入所希望月の1日時点の\n 勤務先（主婦）・学校名・家庭保育　など",null,null,null,null,null,null,null,null,null,null,null,null,null,null,null,null,"居　住　状　況\n(別居の場合住所記入)",null,null,null,null,null,null,null,null,null,null,null,null,null,null,null,"担当者記入欄\n個人番号確認"]
[null,null,null,null,"個人番号（マイナンバー）"]
[null,"児童の世帯員",null,null,"（ふりがな）",null,null,null,null,null,null,null,{"$f":"IFERROR(VLOOKUP(#REF!,ｱｸﾛｼﾃｨV3からの差し込みデータ!$A$15:$M$34,4,FALSE),\"\")","v":""},null,null,null,null,null,null,null,null,null,null,null,null,null,null,null,"本人",null,null,null,null,null,null,null,"Ｓ\n・\nＨ\n・\nＲ",null,null,null,null,null,null,null,null,null,null,{"$f":"IFERROR(VLOOKUP(#REF!,ｱｸﾛｼﾃｨV3からの差し込みデータ!$A$15:$M$34,8,FALSE)+1,\"\")","v":""},null,null,null,null,null,null,null,null,null,null,null,null,null,null,null,null,null,null,null,null,null,null,"（同 ・ 別）",null,null,null,null,null,null,null,null,null,null,null,null,null,null,null,"□個人番号\n　カード\n\n□通知カード\n\n□住民票\n　※コピー可"]
[null,null,null,null,{"$f":"IFERROR(VLOOKUP(#REF!,ｱｸﾛｼﾃｨV3からの差し込みデータ!$A$15:$M$34,3,FALSE),\"\")","v":""}]
[null,null,null,null,"マイナンバー"]
[]
[]
[null,null,null,null,"（ふりがな）",null,null,null,null,null,null,null,{"$f":"IFERROR(VLOOKUP(#REF!,ｱｸﾛｼﾃｨV3からの差し込みデータ!$A$15:$M$34,4,FALSE),\"\")","v":""},null,null,null,null,null,null,null,null,null,null,null,null,null,null,null,"□父　□母\n□きょうだい\n□その他\n　（　　　）",null,null,null,null,null,null,null,"Ｓ\n・\nＨ\n・\nＲ",null,null,null,null,null,null,null,null,null,null,{"$f":"IFERROR(VLOOKUP(#REF!,ｱｸﾛｼﾃｨV3からの差し込みデータ!$A$15:$M$34,8,FALSE)+1,\"\")","v":""},null,null,null,null,null,null,null,null,null,null,null,null,null,null,null,null,null,null,null,null,null,null,"（同 ・ 別）"]
[null,null,null,null,{"$f":"IFERROR(VLOOKUP(#REF!,ｱｸﾛｼﾃｨV3からの差し込みデータ!$A$15:$M$34,3,FALSE),\"\")","v":""}]
{"$rows_left_out":135}